{"text_format":"1","workbook":"xlsx","n_sheets":2,"sheets":["Птп","Птпз"],"not_rendered":{"charts":0,"images":2,"macros":1,"external_links":47,"defined_names":2545,"comments":0,"pivot_tables":0},"unopened":[],"bounds":{"document_bytes":16777216,"sheet_cells":100000,"rows_first":2000,"rows_last":500,"rows_between":2000,"halvings":0,"cell_chars":16384,"cell_head_chars":4096},"cells_cut":0,"cells_raw":0,"read":"whole","date_system":"1900"}

{"sheet":"Птп","index":0,"n_rows":192,"n_cols":58,"rows_kept":192,"cut":false,"hidden":false,"merged":[[116,15,116,25],[99,15,99,19],[46,2,46,8],[164,46,164,51],[164,14,164,29],[163,14,163,45],[132,15,132,19],[82,15,82,19],[147,15,147,19],[162,15,162,19],[164,30,164,45],[2,7,2,10],[4,2,4,6],[41,15,41,18],[39,9,40,9],[39,10,40,10],[41,4,41,5],[29,10,30,10],[23,10,24,10],[22,2,24,5],[32,10,33,10],[3,2,3,6],[31,2,33,5],[4,7,4,10],[5,2,5,6],[7,2,7,6],[0,2,1,10],[64,15,64,18],[10,3,10,5],[10,6,10,8],[11,3,11,5],[11,6,11,8],[8,2,8,6],[9,2,9,6],[3,7,3,10],[5,7,5,10],[6,7,6,10],[7,7,7,10],[8,7,8,10],[2,2,2,6],[44,4,44,5],[42,10,44,10],[6,2,6,6],[12,2,12,10],[13,3,13,5],[13,6,13,8],[14,3,14,5],[14,6,14,8],[9,7,9,10],[43,39,43,46],[42,31,42,46],[42,15,42,30],[43,15,43,22],[43,23,43,30],[43,31,43,38],[42,9,43,9],[26,10,27,10],[34,2,35,8],[36,2,37,8],[42,4,43,5],[42,6,43,6],[42,7,43,7],[42,8,43,8],[38,2,40,8],[214,11,214,12],[221,11,221,12],[204,11,204,12],[213,11,213,12],[15,2,15,10],[17,2,17,10],[25,2,27,5],[28,2,30,6],[41,2,44,3],[49,2,53,10],[45,3,45,4],[45,5,45,7],[47,2,48,10],[16,2,16,7]]}
[null,null,"Расчет платы за технологическое присоединение газоиспользующего оборудования к сетям газораспределения газораспределительных организаций Челябинской области "]
[]
[null,null,"Заявитель",null,null,null,null,null,null,null,null,null,null,"Размер платы за технологическое присоединение (Птп) определяется на основании утвержденных размеров стандартизированных тарифных ставок по следующей формуле"]
[null,null,"Наименование ГРО"]
[null,null,"Расстояние от газоиспользующего оборудования до газораспределительной сети, измеряемое по прямой линии (наименьшее расстояние) (км)",null,null,null,null,null,null,null,null,null,null,"расстояние от газоиспользующего оборудования до газораспределительной сети с проектным рабочим давлением не более 0,3 МПа, измеряемое по прямой линии (наименьшее расстояние), составляет не более 200 метров"]
[null,null,"Количество подключений",null,null,null,null,null,null,null,null,null,null,"ают строительство только газопроводов-вводов (без устройства пунктов редуцирования газа и необходимости выполнения ме"]
[null,null,"Максимальный часовой расход газа, куб.метров в час"]
[null,null,"Давление, Мпа"]
[null,null,"Необходимость строительства пунктов редуцирования газа (да/нет)",null,null,null,null,null,null,null,null,null,null,null,null,null,null,null,null,{"$f":"IF(R10=#REF!,\"Выберите категория грунта\",\" \")","v":{"$error":"#REF!"}}]
[null,null,"Ставка на строительство станций катодной защиты"]
[null,null,null,"Тип трубы",null,null,"Тип прокладки",null,null,"Диаметр трубы","Длина участка (км)",null,"с1","с2","с3","c4","с5","c6","c7.1","c7.2"]
[null,null,"Строительство участка №1","Стальные газопроводы",null,null,"подземная прокладка",null,null,"50 мм и менее",0.5,null,{"$f":"IF(AND(K12>0,D12<>0,G12<>0,J12<>0),VLOOKUP($H$4,O48:S60,2,0),0)","v":{"$error":"#N/A"}},{"$f":"IF(OR(D12=0,G12=0,J12=0,G12=#REF!),0,IF(D12=Q31,VLOOKUP($H$4,O68:AA80,IF(AND(G12=Q32,J12=P66),2,IF(AND(G12=Q33,J12=P66),3,IF(AND(G12=Q32,J12=R66),4,IF(AND(G12=Q33,J12=R66),5,IF(AND(G12=Q32,J12=T66),6,IF(AND(G12=Q33,J12=T66),7,IF(AND(G2=Q32,J12=V66),8,IF(AND(G12=Q33,J12=V66),9,IF(AND(G12=Q32,J12=X66),10,IF(AND(G12=Q33,J12=X66),11,IF(AND(G12=Q32,J12=Z66),12,IF(AND(G12=Q33,J12=Z66),13,0))))))))))))),0))","v":{"$error":"#REF!"}},{"$f":"IF(OR(D12=0,G12=0,J12=0,G12=#REF!),0,IF(D12=P31,VLOOKUP($H$4,O85:U97,IF(AND(G12=P32,J12=P84),2,IF(AND(G12=P32,J12=Q84),3,IF(AND(G12=P32,J12=R84),4,IF(AND(G12=P32,J12=S84),5,IF(AND(G12=P32,J12=T84),6,IF(AND(G12=P32,J12=U84),7,0))))))),0))","v":{"$error":"#REF!"}},{"$f":"IF(G12=#REF!,VLOOKUP(H4,O103:T115,IF(J12=P102,2,IF(J12=Q102,3,IF(J12=R102,4,IF(J12=S102,5,IF(J12=T102,6))))),0),0)","v":{"$error":"#REF!"}},{"$f":"IF(H9=P36,IF(H7=0,0,VLOOKUP(H4,O119:Z131,IF(H7<40,2,IF(AND(99<=H7,H7<=40),3,IF(AND(100<=H7,H7<=399),4,IF(H7<40,2,IF(AND(400<=H7,H7<=999),5,IF(AND(1000<=H7,H7<=1999),6,IF(AND(2000<=H7,H7<=2999),7,IF(AND(3000<=H7,H7<=3999),8,IF(AND(4000<=H7,H7<=4999),9,IF(AND(5000<=H7,H7<=9999),10,IF(AND(10000<=H7,H7<=19999),11,IF(AND(20000<=H7,H7<=29999),12,0)))))))))))))),0)","v":0},{"$f":"IF(H10=P36,VLOOKUP(H4,O134:P146,2),0)","v":0},{"$f":"IF(AND(H6>0,D12<>0),VLOOKUP(H4,O149:Q161,IF(D12=Q31,2,IF(D12=P31,3)),0),0)","v":0},{"$f":"IF(AND(D12=Q31,OR(J12=W13,J12=W14)),VLOOKUP(H4,N168:AB180,2),IF(AND(D12=Q31,J12=X13),VLOOKUP(H4,N168:AB180,3),IF(AND(D12=Q31,J12=Y13),VLOOKUP(H4,N168:AB180,4),IF(AND(D12=Q31,J12=Z13),VLOOKUP(H4,N168:AB180,5),IF(AND(D12=Q31,J12=AA13),VLOOKUP(H4,N168:AB180,6),IF(AND(D12=Q31,J12=AB13),VLOOKUP(H4,N168:AB180,7),IF(AND(D12=Q31,J12=AC13),VLOOKUP(H4,N168:AB180,8),IF(AND(D12=P31,J12=W21),VLOOKUP(H4,N168:AB180,10),IF(AND(D12=Q31,J12=AD13),VLOOKUP(H4,N168:AB180,9),IF(AND(D12=P31,J12=X21),VLOOKUP(H4,N168:AB180,11),IF(AND(D12=P31,J12=Y21),VLOOKUP(H4,N168:AB180,12),IF(AND(D12=P31,J12=Z21),VLOOKUP(H4,N168:AB180,13),IF(AND(D12=P31,J12=AA21),VLOOKUP(H4,N168:AB180,14),IF(AND(D12=P31,J12=AB21),VLOOKUP(H4,N168:AB180,15),0))))))))))))))","v":{"$error":"#N/A"}},null,null,"до 100 мм","108-158 мм","159-218 мм","219-272 мм","273-324 мм","325-425 мм","426-529 мм","530 мм и выше"]
[null,null,null,null,null,null,null,null,null,null,null,null,{"$f":"M12","v":{"$error":"#N/A"}},{"$f":"IFERROR(N12*K12,\"выберите корректные параметры\")","v":"выберите корректные параметры"},{"$f":"IFERROR(O12*K12,\"не правильно заданы параметры\")","v":"не правильно заданы параметры"},{"$f":"IFERROR(P12*K12,\"не правильно заданы параметры\")","v":"не правильно заданы параметры"},{"$f":"Q12*H7","v":0},{"$f":"R12*H7","v":0},{"$f":"S12*U17","v":0},{"$f":"IF(G12=#REF!,\"врезка не может быть осуществлена при бестраншейной прокладке\",T12)","v":{"$error":"#REF!"}},null,"Стальные газопроводы","50 мм и менее","101-158 мм","159 - 218 мм","219 - 272 мм","273 - 324 мм","325 - 425 мм","426 - 529 мм","530 мм и выше"]
[null,null,null,"Тип трубы",null,null,"Тип прокладки",null,null,"Диаметр трубы","Длина участка (км)",null,"с1","с2","с3","c4","с5","c6","c7.1","c7.2",null,null,"51-100 мм"]
[null,null,"Строительство участка №2","Полиэтиленовые газопроводы",null,null,"подземная прокладка",null,null,"109 мм и менее",null,null,{"$f":"IF(AND(K15>0,D15<>0,G15<>0,J15<>0),VLOOKUP($H$4,O48:S60,2,0),0)","v":0},{"$f":"IF(OR(D15=0,G15=0,J15=0,G15=#REF!),0,IF(D15=Q31,VLOOKUP($H$4,O68:AA80,IF(AND(G15=Q32,J15=P66),2,IF(AND(G15=Q33,J15=P66),3,IF(AND(G15=Q32,J15=R66),4,IF(AND(G15=Q33,J15=R66),5,IF(AND(G15=Q32,J15=T66),6,IF(AND(G15=Q33,J15=T66),7,IF(AND(G15=Q32,J15=V66),8,IF(AND(G15=Q33,J15=V66),9,IF(AND(G15=Q32,J15=X66),10,IF(AND(G15=Q33,J15=X66),11,IF(AND(G15=Q32,J15=Z66),12,IF(AND(G15=Q33,J15=Z66),13,0))))))))))))),0))","v":{"$error":"#REF!"}},{"$f":"IF(OR(D15=0,G15=0,J15=0,G15=#REF!),0,IF(D15=P31,VLOOKUP($H$4,O85:U97,IF(AND(G15=P32,J15=P84),2,IF(AND(G15=P32,J15=Q84),3,IF(AND(G15=P32,J15=R84),4,IF(AND(G15=P32,J15=S84),5,IF(AND(G15=P32,J15=T84),6,IF(AND(G15=P32,J15=U84),7,0))))))),0))","v":{"$error":"#REF!"}},{"$f":"IF(G15=#REF!,VLOOKUP(H4,O103:T115,IF(J15=P102,2,IF(J15=Q102,3,IF(J15=R102,4,IF(J15=S102,5,IF(J15=T102,6))))),0),0)","v":{"$error":"#REF!"}},{"$f":"IF(H9=P36,IF(H7=0,0,VLOOKUP(H4,O119:Z131,IF(H7<40,2,IF(AND(99<=H7,H7<=40),3,IF(AND(100<=H7,H7<=399),4,IF(H7<40,2,IF(AND(400<=H7,H7<=999),5,IF(AND(1000<=H7,H7<=1999),6,IF(AND(2000<=H7,H7<=2999),7,IF(AND(3000<=H7,H7<=3999),8,IF(AND(4000<=H7,H7<=4999),9,IF(AND(5000<=H7,H7<=9999),10,IF(AND(10000<=H7,H7<=19999),11,IF(AND(20000<=H7,H7<=29999),12,0)))))))))))))),0)","v":0},{"$f":"IF(H10=P36,VLOOKUP(H4,O134:P146,2),0)","v":0},{"$f":"IF(AND(H6>0,D15<>0),VLOOKUP(H4,O149:Q161,IF(D15=Q31,2,IF(D15=P31,3)),0),0)","v":0},{"$f":"IF(AND(D15=Q31,OR(J15=W13,J15=W14)),VLOOKUP(H4,N168:AB180,2),IF(AND(D15=Q31,J15=X13),VLOOKUP(H4,N168:AB180,3),IF(AND(D15=Q31,J15=Y13),VLOOKUP(H4,N168:AB180,4),IF(AND(D15=Q31,J15=Z13),VLOOKUP(H4,N168:AB180,5),IF(AND(D15=Q31,J15=AA13),VLOOKUP(H4,N168:AB180,6),IF(AND(D15=Q31,J15=AB13),VLOOKUP(H4,N168:AB180,7),IF(AND(D15=Q31,J15=AC13),VLOOKUP(H4,N168:AB180,8),IF(AND(D15=P31,J15=W21),VLOOKUP(H4,N168:AB180,10),IF(AND(D15=Q31,J15=AD13),VLOOKUP(H4,N168:AB180,9),IF(AND(D15=P31,J15=X21),VLOOKUP(H4,N168:AB180,11),IF(AND(D15=P31,J15=Y21),VLOOKUP(H4,N168:AB180,12),IF(AND(D15=P31,J15=Z21),VLOOKUP(H4,N168:AB180,13),IF(AND(D15=P31,J15=AA21),VLOOKUP(H4,N168:AB180,14),IF(AND(D15=P31,J15=AB21),VLOOKUP(H4,N168:AB180,15),0))))))))))))))","v":{"$error":"#N/A"}}]
[null,null,{"$f":"IF(OR(J47=M30,J47=M31),\"При данных условиях подключения заявитель относится к льготной категории!!!\",\"\")","v":""},null,null,null,null,null,null,null,null,null,{"$f":"M15","v":0},{"$f":"IFERROR(N15*K15,\"не правильно заданы параметры\")","v":"не правильно заданы параметры"},{"$f":"IFERROR(O15*K15,\"не правильно заданы параметры\")","v":"не правильно заданы параметры"},{"$f":"IFERROR(P15*K15,\"не правильно заданы параметры\")","v":"не правильно заданы параметры"},{"$f":"Q15*H7","v":0},{"$f":"R15*H7","v":0},{"$f":"S15*U17","v":0},{"$f":"IF(G15=#REF!,\"врезка не может быть осуществлена при бестраншейной прокладке\",T15)","v":{"$error":"#REF!"}},null,"Полиэтиленовые газопроводы"]
[null,null,{"$f":"IF(C16=\"При данных условиях подключения заявитель относится к льготной категории!!!\",\"Плата за технологическое присоединение (Птп) составит\",\"\")","v":""},null,null,null,null,null,{"$f":"IF(C17=\"Плата за технологическое присоединение (Птп) составит\",J47,\"\")","v":""},{"$f":"IF(C17=\"Плата за технологическое присоединение (Птп) составит\",\"руб с учетом НДС\",\"\")","v":""},null,null,"до 100 мм","ДИАМ C1","ДЛИНА С1",null,{"$f":"INDIRECT(IF(AND(D12=Q31,OR(G12=Q32,G12=Q33)),SUBSTITUTE($R$31,\" \",\"_\"),IF(AND(D12=Q31,G12=#REF!),SUBSTITUTE($T$31,\" \",\"_\"),IF(AND(D12=P31,G12=P32),SUBSTITUTE($S$31,\" \",\"_\"),IF(AND(D12=P31,G12=#REF!),SUBSTITUTE($U$31,\" \",\"_\"),0)))))","v":{"$error":"#VALUE!"}},null,null,"Z - коэффициент подключений",{"$f":"IF(H6=0,0,IF(AND(1<=H6,H6<=5),U18,IF(AND(6<=H6,H6<=10),U19,IF(AND(11<=H6,H6<=30),U20,IF(AND(31<=H6,H6<=100),U21,IF(H6>100,U22,0))))))","v":0}]
[null,null,null,null,null,null,null,null,null,null,null,null,"101 мм и более",{"$f":"IF(OR(J12=R32,J12=R33,J12=T32,J12=T33),100,IF(OR(J12=R34,J12=R35,J12=R36,J12=R37,J12=S32,J12=S33,J12=S34,J12=S35,J12=S36,J12=S37,J12=T34,J12=U33,J12=U32),101,0))","v":100},{"$f":"IF(AND(K12*1000>=1,K12*1000<=100),1,IF(AND(K12*1000>=101,K12*1000<=500),2,IF(AND(K12*1000>=501,K12*1000<=1000),3,IF(AND(K12*1000>=1001,K12*1000<=2000),4,IF(AND(K12*1000>=2001,K12*1000<=3000),5,IF(AND(K12*1000>=3001,K12*1000<=4000),6,IF(AND(K12*1000>=4001,K12*1000<=5000),7,IF(K12*1000>=5001,8,0))))))))","v":2},null,null,null,null,"1 - 5 подключений",1]
[null,null,null,null,null,null,null,null,null,null,null,null,"нет",{"$f":"IF(OR(J15=R32,J15=R33,J15=T32,J15=T33),100,IF(OR(J15=R34,J15=R35,J15=R36,J15=R37,J15=S32,J15=S33,J15=S34,J15=S35,J15=S36,J15=S37,J15=T34,J15=U33,J15=U32),101,0))","v":101},{"$f":"IF(AND(K15*1000>=1,K15*1000<=100),1,IF(AND(K15*1000>=101,K15*1000<=500),2,IF(AND(K15*1000>=501,K15*1000<=1000),3,IF(AND(K15*1000>=1001,K15*1000<=2000),4,IF(AND(K15*1000>=2001,K15*1000<=3000),5,IF(AND(K15*1000>=3001,K15*1000<=4000),6,IF(AND(K15*1000>=4001,K15*1000<=5000),7,IF(K15*1000>=5001,8,0))))))))","v":0},null,null,null,null,"6 - 10 подключений",1.5]
[null,null,null,null,null,null,null,null,null,null,null,null,"до 100 м",null,null,null,null," ",null,"11 - 30 подключений",3,null,"109 мм и менее","110-159 мм","160-224 мм","225-314 мм","315-399 мм","400 мм и выше"]
{"$rows_left_out":173}
{"sheet":"Птпз","index":1,"n_rows":155,"n_cols":26,"rows_kept":155,"cut":false,"hidden":false,"merged":[[31,11,32,11],[34,11,35,11],[31,7,32,7],[31,9,32,9],[23,11,24,11],[28,11,29,11],[27,2,27,8],[28,2,29,8],[23,9,24,9],[30,2,30,6],[31,2,32,6],[31,8,32,8],[33,2,33,8],[34,2,35,8],[34,10,35,10],[28,10,29,10],[39,16,39,19],[40,16,40,17],[40,18,40,19],[14,2,16,10],[34,9,35,9],[23,5,24,5],[23,10,24,10],[22,2,22,4],[20,2,20,8],[21,2,21,8],[23,2,24,4],[23,6,24,6],[23,8,24,8],[23,7,24,7],[31,10,32,10],[43,2,47,10],[28,9,29,9],[11,2,11,6],[12,2,12,6],[11,7,11,8],[12,7,12,8],[11,9,11,10],[12,9,12,10],[26,2,26,7],[25,2,25,7],[8,6,8,8],[7,2,7,10],[8,2,8,5],[9,6,9,8],[10,2,10,10],[9,2,9,5],[4,2,4,6],[5,2,5,6],[6,2,6,6],[6,7,6,10],[4,7,4,11],[5,7,5,11],[3,2,3,6],[2,2,2,6],[2,7,2,11],[3,7,3,11],[0,2,1,11],[71,19,71,27],[42,2,42,9],[76,21,76,22],[76,23,76,25],[75,15,75,23],[76,15,76,16],[76,17,76,18],[76,19,76,20],[49,23,49,28]]}
[null,null,"Расчет платы за технологическое присоединение в границах земельного участка Заявителя "]
[]
[null,null,"Цель использования газа",null,null,null,null,null,null,null,null,null,null,null,"Размер платы за технологическое присоединение (Птп) определяется на основании утвержденных размеров стандартизированных тарифных ставок по следующей формуле"]
[null,null,"Наименование ГРО"]
[null,null,"Количество отключающих устройств",null,null,null,null,null,null,null,null,null,null,null,"ают строительство только газопроводов-вводов (без устройства пунктов редуцирования газа и необходимости выполнения ме"]
[null,null,"Максимальный часовой расход газа, куб.метров в час"]
[null,null,"Необходимость строительства пунктов редуцирования газа (да/нет)"]
[null,null,"Строительство газопровода внутри границ участка Заявителя до объекта капитального строительства\nгазопровода внутри границ участка Заявителя до объекта капитального строительства "]
[null,null,"Тип трубы",null,null,null,"Тип прокладки",null,null,"Диаметр трубы","Длина участка (км)"]
[null,null,"Полиэтиленовый газопровод",null,null,null,"подземная прокладка",null,null,"26-38 мм",0.02]
[null,null,"Строительство на объекте капитального строительства внутренних газопроводов"]
[null,null,"Тип трубы",null,null,null,null,"Диаметр трубы",null,"Длина участка (км)"]
[null,null,"Стальные газопроводы",null,null,null,null,"11-15 мм",null,0.01]
[]
[null,null,"Размер платы за технологическое присоединение в границах земельного участка Заявителя определяется по следующей формуле:\n",null,null,null,null,null,null,null,null,null,null,"Спр","Сг","Спрг","Соу","Сокс","Спу"]
[null,null,null,null,null,null,null,null,null,null,null,null,null,{"$f":"VLOOKUP($H$4,O59:P71,2,0)","v":{"$error":"#N/A"}},{"$f":"IF(AND(C10=R29,G10=R30,J10=S30),VLOOKUP(H4,O79:Z92,2,0),IF(AND(C10=R29,G10=R30,J10=S31),VLOOKUP(H4,O79:Z92,4,0),IF(AND(C10=R29,G10=R30,J10=S32),VLOOKUP(H4,O79:Z92,6,0),IF(AND(C10=R29,G10=R30,J10=S33),VLOOKUP(H4,O79:Z92,8,0),IF(AND(C10=R29,G10=R31,J10=S30),VLOOKUP(H4,O79:Z92,3,0),IF(AND(C10=R29,G10=R31,J10=S31),VLOOKUP(H4,O79:Z92,5,0),IF(AND(C10=R29,G10=R31,J10=S32),VLOOKUP(H4,O79:Z92,7,0),IF(AND(C10=R29,G10=R31,J10=S33),VLOOKUP(H4,O79:Z92,9,0),IF(AND(C10=Q29,J10=T30),VLOOKUP(H4,O79:Z92,10,0),IF(AND(C10=Q29,J10=T31),VLOOKUP(H4,O79:Z92,11,0),IF(AND(C10=Q29,J10=T32),VLOOKUP(H4,O79:Z92,12,0),\"не правильно заданы параметры\")))))))))))","v":"не правильно заданы параметры"},{"$f":"IF(H7=Q34,IF(H6=0,0,VLOOKUP(H4,O95:S108,IF(OR(H6>10,H6=10),2,IF(AND(11<=H6,H6<=20),3,IF(AND(21<=H6,H6<=31),4,IF(AND(32<=H6,H6<=49),5)))))),0)","v":0},{"$f":"IF(H5=0,0,VLOOKUP(H4,O111:P123,2))","v":0},{"$f":"IF(H32=Q35,0,VLOOKUP(H4,O128:T140,IF(I32=P127,2,IF(I32=Q127,3,IF(I32=R127,4,IF(I32=S127,5,IF(I32=T127,6))))),0))","v":{"$error":"#N/A"}},{"$f":"VLOOKUP(H4,O143:P155,2)","v":{"$error":"#N/A"}}]
[null,null,null,null,null,null,null,null,null,null,null,null,null,{"$f":"N16","v":{"$error":"#N/A"}},{"$f":"IFERROR(O16*K10*1000,\"не правильно заданы параметры\")","v":"не правильно заданы параметры"},{"$f":"P16","v":0},{"$f":"Q16*H5","v":0},{"$f":"R16","v":{"$error":"#N/A"}},{"$f":"IFERROR(S16,\"укажитекорретные параметры\")","v":"укажитекорретные параметры"}]
[null,null,null,null,null,null,null,null,null,null,null,null,null,null,null,null,null,null," "]
[null,null,null,null,null,null,null,null,null,null,null,null,null,null,{"$f":"IF(K10=0,0,IF(AND(C10=R29,G10=R30,J10=S30),VLOOKUP($H$4,O79:Z91,2),IF(AND(C10=R29,G10=R30,J10=R77),VLOOKUP($H$4,O79:Z91,4),IF(AND(C10=R29,G10=R30,J10=T77),VLOOKUP($H$4,O79:Z91,6),IF(AND(C10=R29,G10=R30,J10=V77),VLOOKUP($H$4,O79:Z91,8),0)))))","v":0},null,null,null,"с1"]
[null,null,null,null,null,null,null,null,null,null,null,null,null,null,null,null,null,null,"c2",{"$f":"IF(OR(#REF!=0,#REF!=0,#REF!=0),0,IF(#REF!=R29,VLOOKUP($H$4,#REF!,IF(AND(#REF!=R30,#REF!=#REF!),2,IF(AND(#REF!=R31,#REF!=#REF!),3,0))),0))","v":{"$error":"#REF!"}}]
{"$rows_left_out":135}