{"text_format":"1","workbook":"xlsx","n_sheets":2,"sheets":["Птп","Птпз"],"not_rendered":{"charts":0,"images":2,"macros":1,"external_links":47,"defined_names":2545,"comments":0,"pivot_tables":0},"unopened":[],"bounds":{"document_bytes":16777216,"sheet_cells":100000,"rows_first":2000,"rows_last":500,"rows_between":2000,"halvings":0,"cell_chars":16384,"cell_head_chars":4096},"cells_cut":0,"cells_raw":0,"read":"whole","date_system":"1900"}

{"sheet":"Птп","index":0,"n_rows":214,"n_cols":59,"rows_kept":214,"cut":false,"hidden":false,"merged":[[144,16,144,20],[85,16,85,20],[163,16,163,20],[182,16,182,20],[184,47,184,58],[183,47,183,58],[184,15,184,30],[184,31,184,46],[125,16,125,26],[105,16,105,20],[183,15,183,46],[2,8,2,11],[4,2,4,7],[41,16,41,19],[39,10,40,10],[39,11,40,11],[29,11,30,11],[23,11,24,11],[32,11,33,11],[3,2,3,7],[31,2,33,5],[4,8,4,11],[5,2,5,7],[7,2,7,7],[6,2,6,7],[13,7,13,9],[14,3,14,5],[0,2,1,11],[63,16,63,19],[10,3,10,5],[10,7,10,9],[11,3,11,5],[11,7,11,9],[8,2,8,7],[9,2,9,7],[3,8,3,11],[5,8,5,11],[6,8,6,11],[7,8,7,11],[8,8,8,11],[2,2,2,7],[12,2,12,11],[13,3,13,5],[14,7,14,9],[9,8,9,11],[43,40,43,47],[42,32,42,47],[42,16,42,31],[43,16,43,23],[43,24,43,31],[43,32,43,39],[15,2,15,11],[17,2,17,11],[28,2,30,7],[25,2,27,6],[22,2,24,6],[42,10,43,10],[26,11,27,11],[34,2,35,9],[45,3,45,4],[45,5,45,8],[47,2,48,11],[16,2,16,8],[42,11,44,11],[41,2,44,5],[46,2,46,9],[36,2,37,9],[42,7,43,7],[42,8,43,8],[42,9,43,9],[38,2,40,9],[42,6,43,6],[236,12,236,13],[243,12,243,13],[226,12,226,13],[235,12,235,13],[49,2,53,11]]}
[null,null,"Расчет платы за технологическое присоединение газоиспользующего оборудования к сетям газораспределения газораспределительных организаций Челябинской области ",null,null,null,null,null,null,null,null,null,null,"до 5 м3/ч",27774.92,"с НДС"]
[null,null,null,null,null,null,null,null,null,null,null,null,null,"до1 5 м3/ч",57864.41,"без НДС"]
[null,null,"Заявитель",null,null,null,null,null,null,null,null,null,null,null,"Размер платы за технологическое присоединение (Птп) определяется на основании утвержденных размеров стандартизированных тарифных ставок по следующей формуле"]
[null,null,"Наименование ГРО"]
[null,null,"Расстояние от газоиспользующего оборудования до газораспределительной сети, измеряемое по прямой линии (наименьшее расстояние) (км)",null,null,null,null,null,null,null,null,null,null,null,"расстояние от газоиспользующего оборудования до газораспределительной сети с проектным рабочим давлением не более 0,3 МПа, измеряемое по прямой линии (наименьшее расстояние), составляет не более 200 метров"]
[null,null,"Количество подключений",null,null,null,null,null,null,null,null,null,null,null,"ают строительство только газопроводов-вводов (без устройства пунктов редуцирования газа и необходимости выполнения ме"]
[null,null,"Максимальный часовой расход газа, куб.метров в час"]
[null,null,"Давление, Мпа"]
[null,null,"Необходимость строительства пунктов редуцирования газа (да/нет)",null,null,null,null,null,null,null,null,null,null,null,null,null,null,null,null,null,{"$f":"IF(S10=#REF!,\"Выберите категория грунта\",\" \")","v":{"$error":"#REF!"}}]
[null,null,"Ставка на строительство станций катодной защиты"]
[null,null,null,"Тип трубы",null,null,null,"Тип прокладки",null,null,"Диаметр трубы","Длина участка (км)",null,"с1","с2","с3","c4","с5","c6","c7.1","c7.2"]
[null,null,"Строительство участка №1","Стальные газопроводы",null,null,null,"подземная прокладка",null,null,"50 мм и менее",0.5,null,{"$f":"IF(AND(L12>0,D12<>0,H12<>0,K12<>0),VLOOKUP($I$4,P48:T59,2,0),0)","v":{"$error":"#N/A"}},{"$f":"IF(OR(D12=0,H12=0,K12=0,H12=#REF!),0,IF(D12=R31,VLOOKUP($I$4,P67:AB78,IF(AND(H12=R32,K12=Q65),2,IF(AND(H12=R33,K12=Q65),3,IF(AND(H12=R32,K12=S65),4,IF(AND(H12=R33,K12=S65),5,IF(AND(H12=R32,K12=U65),6,IF(AND(H12=R33,K12=U65),7,IF(AND(H2=R32,K12=W65),8,IF(AND(H12=R33,K12=W65),9,IF(AND(H12=R32,K12=Y65),10,IF(AND(H12=R33,K12=Y65),11,IF(AND(H12=R32,K12=AA65),12,IF(AND(H12=R33,K12=AA65),13,0))))))))))))),0))","v":{"$error":"#REF!"}},{"$f":"IF(OR(D12=0,H12=0,K12=0,H12=#REF!),0,IF(D12=Q31,VLOOKUP($I$4,P88:V99,IF(AND(H12=Q32,K12=Q87),2,IF(AND(H12=Q32,K12=R87),3,IF(AND(H12=Q32,K12=S87),4,IF(AND(H12=Q32,K12=T87),5,IF(AND(H12=Q32,K12=U87),6,IF(AND(H12=Q32,K12=V87),7,0))))))),0))","v":{"$error":"#REF!"}},{"$f":"IF(H12=#REF!,VLOOKUP(I4,P110:X121,IF(K12=Q108,2,IF(K12=R108,3,IF(K12=S108,4,IF(K12=T108,5,IF(K12=Y108,6))))),0),0)","v":{"$error":"#REF!"}},{"$f":"IF(I9=Q36,IF(I7=0,0,VLOOKUP(I4,P128:AA139,IF(I7<40,2,IF(AND(99<=I7,I7<=40),3,IF(AND(100<=I7,I7<=399),4,IF(I7<40,2,IF(AND(400<=I7,I7<=999),5,IF(AND(1000<=I7,I7<=1999),6,IF(AND(2000<=I7,I7<=2999),7,IF(AND(3000<=I7,I7<=3999),8,IF(AND(4000<=I7,I7<=4999),9,IF(AND(5000<=I7,I7<=9999),10,IF(AND(10000<=I7,I7<=19999),11,IF(AND(20000<=I7,I7<=29999),12,0)))))))))))))),0)","v":0},{"$f":"IF(I10=Q36,VLOOKUP(I4,P146:Q157,2),0)","v":0},{"$f":"IF(AND(I6>0,D12<>0),VLOOKUP(I4,P165:R176,IF(D12=R31,2,IF(D12=Q31,3)),0),0)","v":0},{"$f":"IF(AND(D12=R31,OR(K12=X13,K12=X14)),VLOOKUP(I4,O188:AC199,2),IF(AND(D12=R31,K12=Y13),VLOOKUP(I4,O188:AC199,3),IF(AND(D12=R31,K12=Z13),VLOOKUP(I4,O188:AC199,4),IF(AND(D12=R31,K12=AA13),VLOOKUP(I4,O188:AC199,5),IF(AND(D12=R31,K12=AB13),VLOOKUP(I4,O188:AC199,6),IF(AND(D12=R31,K12=AC13),VLOOKUP(I4,O188:AC199,7),IF(AND(D12=R31,K12=AD13),VLOOKUP(I4,O188:AC199,8),IF(AND(D12=Q31,K12=X21),VLOOKUP(I4,O188:AC199,10),IF(AND(D12=R31,K12=AE13),VLOOKUP(I4,O188:AC199,9),IF(AND(D12=Q31,K12=Y21),VLOOKUP(I4,O188:AC199,11),IF(AND(D12=Q31,K12=Z21),VLOOKUP(I4,O188:AC199,12),IF(AND(D12=Q31,K12=AA21),VLOOKUP(I4,O188:AC199,13),IF(AND(D12=Q31,K12=AB21),VLOOKUP(I4,O188:AC199,14),IF(AND(D12=Q31,K12=AC21),VLOOKUP(I4,O188:AC199,15),0))))))))))))))","v":{"$error":"#N/A"}},null,null,"до 100 мм","108-158 мм","159-218 мм","219-272 мм","273-324 мм","325-425 мм","426-529 мм","530 мм и выше"]
[null,null,null,null,null,null,null,null,null,null,null,null,null,{"$f":"N12","v":{"$error":"#N/A"}},{"$f":"IFERROR(O12*L12,\"выберите корректные параметры\")","v":"выберите корректные параметры"},{"$f":"IFERROR(P12*L12,\"не правильно заданы параметры\")","v":"не правильно заданы параметры"},{"$f":"IFERROR(Q12*L12,\"не правильно заданы параметры\")","v":"не правильно заданы параметры"},{"$f":"R12*I7","v":0},{"$f":"S12*I7","v":0},{"$f":"T12*V17","v":0},{"$f":"IF(H12=#REF!,\"врезка не может быть осуществлена при бестраншейной прокладке\",U12)","v":{"$error":"#REF!"}},null,"Стальные газопроводы","50 мм и менее","101-158 мм","159 - 218 мм","219 - 272 мм","273 - 324 мм","325 - 425 мм","426 - 529 мм","530 мм и выше"]
[null,null,null,"Тип трубы",null,null,null,"Тип прокладки",null,null,"Диаметр трубы","Длина участка (км)",null,"с1","с2","с3","c4","с5","c6","c7.1","c7.2",null,null,"51-100 мм"]
[null,null,"Строительство участка №2","Полиэтиленовые газопроводы",null,null,null,"подземная прокладка",null,null,"109 мм и менее",null,null,{"$f":"IF(AND(L15>0,D15<>0,H15<>0,K15<>0),VLOOKUP($I$4,P48:T59,2,0),0)","v":0},{"$f":"IF(OR(D15=0,H15=0,K15=0,H15=#REF!),0,IF(D15=R31,VLOOKUP($I$4,P67:AB78,IF(AND(H15=R32,K15=Q65),2,IF(AND(H15=R33,K15=Q65),3,IF(AND(H15=R32,K15=S65),4,IF(AND(H15=R33,K15=S65),5,IF(AND(H15=R32,K15=U65),6,IF(AND(H15=R33,K15=U65),7,IF(AND(H15=R32,K15=W65),8,IF(AND(H15=R33,K15=W65),9,IF(AND(H15=R32,K15=Y65),10,IF(AND(H15=R33,K15=Y65),11,IF(AND(H15=R32,K15=AA65),12,IF(AND(H15=R33,K15=AA65),13,0))))))))))))),0))","v":{"$error":"#REF!"}},{"$f":"IF(OR(D15=0,H15=0,K15=0,H15=#REF!),0,IF(D15=Q31,VLOOKUP($I$4,P88:V99,IF(AND(H15=Q32,K15=Q87),2,IF(AND(H15=Q32,K15=R87),3,IF(AND(H15=Q32,K15=S87),4,IF(AND(H15=Q32,K15=T87),5,IF(AND(H15=Q32,K15=U87),6,IF(AND(H15=Q32,K15=V87),7,0))))))),0))","v":{"$error":"#REF!"}},{"$f":"IF(H15=#REF!,VLOOKUP(I4,P110:X121,IF(K15=Q108,2,IF(K15=R108,3,IF(K15=S108,4,IF(K15=T108,5,IF(K15=Y108,6))))),0),0)","v":{"$error":"#REF!"}},{"$f":"IF(I9=Q36,IF(I7=0,0,VLOOKUP(I4,P128:AA139,IF(I7<40,2,IF(AND(99<=I7,I7<=40),3,IF(AND(100<=I7,I7<=399),4,IF(I7<40,2,IF(AND(400<=I7,I7<=999),5,IF(AND(1000<=I7,I7<=1999),6,IF(AND(2000<=I7,I7<=2999),7,IF(AND(3000<=I7,I7<=3999),8,IF(AND(4000<=I7,I7<=4999),9,IF(AND(5000<=I7,I7<=9999),10,IF(AND(10000<=I7,I7<=19999),11,IF(AND(20000<=I7,I7<=29999),12,0)))))))))))))),0)","v":0},{"$f":"IF(I10=Q36,VLOOKUP(I4,P146:Q157,2),0)","v":0},{"$f":"IF(AND(I6>0,D15<>0),VLOOKUP(I4,P165:R176,IF(D15=R31,2,IF(D15=Q31,3)),0),0)","v":0},{"$f":"IF(AND(D15=R31,OR(K15=X13,K15=X14)),VLOOKUP(I4,O188:AC199,2),IF(AND(D15=R31,K15=Y13),VLOOKUP(I4,O188:AC199,3),IF(AND(D15=R31,K15=Z13),VLOOKUP(I4,O188:AC199,4),IF(AND(D15=R31,K15=AA13),VLOOKUP(I4,O188:AC199,5),IF(AND(D15=R31,K15=AB13),VLOOKUP(I4,O188:AC199,6),IF(AND(D15=R31,K15=AC13),VLOOKUP(I4,O188:AC199,7),IF(AND(D15=R31,K15=AD13),VLOOKUP(I4,O188:AC199,8),IF(AND(D15=Q31,K15=X21),VLOOKUP(I4,O188:AC199,10),IF(AND(D15=R31,K15=AE13),VLOOKUP(I4,O188:AC199,9),IF(AND(D15=Q31,K15=Y21),VLOOKUP(I4,O188:AC199,11),IF(AND(D15=Q31,K15=Z21),VLOOKUP(I4,O188:AC199,12),IF(AND(D15=Q31,K15=AA21),VLOOKUP(I4,O188:AC199,13),IF(AND(D15=Q31,K15=AB21),VLOOKUP(I4,O188:AC199,14),IF(AND(D15=Q31,K15=AC21),VLOOKUP(I4,O188:AC199,15),0))))))))))))))","v":{"$error":"#N/A"}}]
[null,null,{"$f":"IF(OR(K47=N30,K47=N31),\"При данных условиях подключения заявитель относится к льготной категории!!!\",\"\")","v":""},null,null,null,null,null,null,null,null,null,null,{"$f":"N15","v":0},{"$f":"IFERROR(O15*L15,\"не правильно заданы параметры\")","v":"не правильно заданы параметры"},{"$f":"IFERROR(P15*L15,\"не правильно заданы параметры\")","v":"не правильно заданы параметры"},{"$f":"IFERROR(Q15*L15,\"не правильно заданы параметры\")","v":"не правильно заданы параметры"},{"$f":"R15*I7","v":0},{"$f":"S15*I7","v":0},{"$f":"T15*V17","v":0},{"$f":"IF(H15=#REF!,\"врезка не может быть осуществлена при бестраншейной прокладке\",U15)","v":{"$error":"#REF!"}},null,"Полиэтиленовые газопроводы"]
[null,null,{"$f":"IF(C16=\"При данных условиях подключения заявитель относится к льготной категории!!!\",\"Плата за технологическое присоединение (Птп) составит\",\"\")","v":""},null,null,null,null,null,null,{"$f":"IF(C17=\"Плата за технологическое присоединение (Птп) составит\",K47,\"\")","v":""},{"$f":"IF(C17=\"Плата за технологическое присоединение (Птп) составит\",\"руб с учетом НДС\",\"\")","v":""},null,null,"до 100 мм","ДИАМ C1","ДЛИНА С1",null,{"$f":"INDIRECT(IF(AND(D12=R31,OR(H12=R32,H12=R33)),SUBSTITUTE($S$31,\" \",\"_\"),IF(AND(D12=R31,H12=#REF!),SUBSTITUTE($U$31,\" \",\"_\"),IF(AND(D12=Q31,H12=Q32),SUBSTITUTE($T$31,\" \",\"_\"),IF(AND(D12=Q31,H12=#REF!),SUBSTITUTE($V$31,\" \",\"_\"),0)))))","v":{"$error":"#VALUE!"}},null,null,"Z - коэффициент подключений",{"$f":"IF(I6=0,0,IF(AND(1<=I6,I6<=5),V18,IF(AND(6<=I6,I6<=10),V19,IF(AND(11<=I6,I6<=30),V20,IF(AND(31<=I6,I6<=100),V21,IF(I6>100,V22,0))))))","v":0}]
[null,null,null,null,null,null,null,null,null,null,null,null,null,"101 мм и более",{"$f":"IF(OR(K12=S32,K12=S33,K12=U32,K12=U33),100,IF(OR(K12=S34,K12=S35,K12=S36,K12=S37,K12=T32,K12=T33,K12=T34,K12=T35,K12=T36,K12=T37,K12=U34,K12=V33,K12=V32),101,0))","v":100},{"$f":"IF(AND(L12*1000>=1,L12*1000<=100),1,IF(AND(L12*1000>=101,L12*1000<=500),2,IF(AND(L12*1000>=501,L12*1000<=1000),3,IF(AND(L12*1000>=1001,L12*1000<=2000),4,IF(AND(L12*1000>=2001,L12*1000<=3000),5,IF(AND(L12*1000>=3001,L12*1000<=4000),6,IF(AND(L12*1000>=4001,L12*1000<=5000),7,IF(L12*1000>=5001,8,0))))))))","v":2},null,null,null,null,"1 - 5 подключений",1]
[null,null,null,null,null,null,null,null,null,null,null,null,null,"нет",{"$f":"IF(OR(K15=S32,K15=S33,K15=U32,K15=U33),100,IF(OR(K15=S34,K15=S35,K15=S36,K15=S37,K15=T32,K15=T33,K15=T34,K15=T35,K15=T36,K15=T37,K15=U34,K15=V33,K15=V32),101,0))","v":101},{"$f":"IF(AND(L15*1000>=1,L15*1000<=100),1,IF(AND(L15*1000>=101,L15*1000<=500),2,IF(AND(L15*1000>=501,L15*1000<=1000),3,IF(AND(L15*1000>=1001,L15*1000<=2000),4,IF(AND(L15*1000>=2001,L15*1000<=3000),5,IF(AND(L15*1000>=3001,L15*1000<=4000),6,IF(AND(L15*1000>=4001,L15*1000<=5000),7,IF(L15*1000>=5001,8,0))))))))","v":0},null,null,null,null,"6 - 10 подключений",1.5]
[null,null,null,null,null,null,null,null,null,null,null,null,null,"до 100 м",null,null,null,null," ",null,"11 - 30 подключений",3,null,"109 мм и менее","110-159 мм","160-224 мм","225-314 мм","315-399 мм","400 мм и выше"]
{"$rows_left_out":195}
{"sheet":"Птпз","index":1,"n_rows":169,"n_cols":26,"rows_kept":169,"cut":false,"hidden":false,"merged":[[34,11,35,11],[31,7,32,7],[31,9,32,9],[23,11,24,11],[28,11,29,11],[27,2,27,8],[28,2,29,8],[23,9,24,9],[30,2,30,6],[31,2,32,6],[31,8,32,8],[33,2,33,8],[34,2,35,8],[34,10,35,10],[28,10,29,10],[28,9,29,9],[39,16,39,19],[40,16,40,17],[40,18,40,19],[14,2,16,10],[34,9,35,9],[23,5,24,5],[23,10,24,10],[22,2,22,4],[20,2,20,8],[21,2,21,8],[23,2,24,4],[23,6,24,6],[23,8,24,8],[23,7,24,7],[31,10,32,10],[31,11,32,11],[26,2,26,7],[25,2,25,7],[8,6,8,8],[7,2,7,10],[8,2,8,5],[9,6,9,8],[10,2,10,10],[9,2,9,5],[11,2,11,6],[12,2,12,6],[11,7,11,8],[12,7,12,8],[11,9,11,10],[12,9,12,10],[4,2,4,6],[5,2,5,6],[6,2,6,6],[6,7,6,10],[4,7,4,11],[5,7,5,11],[3,2,3,6],[2,2,2,6],[2,7,2,11],[3,7,3,11],[0,2,1,11],[72,19,72,27],[42,2,42,9],[77,21,77,22],[77,23,77,25],[76,15,76,23],[77,15,77,16],[77,17,77,18],[77,19,77,20],[49,23,49,28],[43,2,47,11]]}
[null,null,"Расчет платы за технологическое присоединение в границах земельного участка Заявителя "]
[]
[null,null,"Цель использования газа",null,null,null,null,null,null,null,null,null,null,null,"Размер платы за технологическое присоединение (Птп) определяется на основании утвержденных размеров стандартизированных тарифных ставок по следующей формуле"]
[null,null,"Наименование ГРО"]
[null,null,"Количество отключающих устройств",null,null,null,null,null,null,null,null,null,null,null,"ают строительство только газопроводов-вводов (без устройства пунктов редуцирования газа и необходимости выполнения ме"]
[null,null,"Максимальный часовой расход газа, куб.метров в час"]
[null,null,"Необходимость строительства пунктов редуцирования газа (да/нет)"]
[null,null,"Строительство газопровода внутри границ участка Заявителя до объекта капитального строительства\nгазопровода внутри границ участка Заявителя до объекта капитального строительства "]
[null,null,"Тип трубы",null,null,null,"Тип прокладки",null,null,"Диаметр трубы","Длина участка (км)"]
[null,null,"Полиэтиленовый газопровод",null,null,null,"подземная прокладка",null,null,"26-38 мм",0.02]
[null,null,"Строительство на объекте капитального строительства внутренних газопроводов"]
[null,null,"Тип трубы",null,null,null,null,"Диаметр трубы",null,"Длина участка (км)"]
[null,null,"Стальные газопроводы",null,null,null,null,"11-15 мм",null,0.01]
[]
[null,null,"Размер платы за технологическое присоединение в границах земельного участка Заявителя определяется по следующей формуле:\n",null,null,null,null,null,null,null,null,null,null,"Спр","Сг","Спрг","Соу","Сокс","Спу"]
[null,null,null,null,null,null,null,null,null,null,null,null,null,{"$f":"VLOOKUP($H$4,O59:P73,2,0)","v":{"$error":"#N/A"}},{"$f":"IF(AND(C10=R29,G10=R30,J10=S30),VLOOKUP(H4,O80:Z96,2,0),IF(AND(C10=R29,G10=R30,J10=S31),VLOOKUP(H4,O80:Z96,4,0),IF(AND(C10=R29,G10=R30,J10=S32),VLOOKUP(H4,O80:Z96,6,0),IF(AND(C10=R29,G10=R30,J10=S33),VLOOKUP(H4,O80:Z96,8,0),IF(AND(C10=R29,G10=R31,J10=S30),VLOOKUP(H4,O80:Z96,3,0),IF(AND(C10=R29,G10=R31,J10=S31),VLOOKUP(H4,O80:Z96,5,0),IF(AND(C10=R29,G10=R31,J10=S32),VLOOKUP(H4,O80:Z96,7,0),IF(AND(C10=R29,G10=R31,J10=S33),VLOOKUP(H4,O80:Z96,9,0),IF(AND(C10=Q29,J10=T30),VLOOKUP(H4,O80:Z96,10,0),IF(AND(C10=Q29,J10=T31),VLOOKUP(H4,O80:Z96,11,0),IF(AND(C10=Q29,J10=T32),VLOOKUP(H4,O80:Z96,12,0),\"не правильно заданы параметры\")))))))))))","v":"не правильно заданы параметры"},{"$f":"IF(H7=Q34,IF(H6=0,0,VLOOKUP(H4,O99:S114,IF(OR(H6>10,H6=10),2,IF(AND(11<=H6,H6<=20),3,IF(AND(21<=H6,H6<=31),4,IF(AND(32<=H6,H6<=49),5)))),0)),0)","v":0},{"$f":"IF(H5=0,0,VLOOKUP(H4,O117:P131,2,0))","v":0},{"$f":"IF(H32=Q35,0,VLOOKUP(H4,O138:T152,IF(I32=P137,2,IF(I32=Q137,3,IF(I32=R137,4,IF(I32=S137,5,IF(I32=T137,6))))),0))","v":{"$error":"#N/A"}},{"$f":"VLOOKUP(H4,O155:P169,2,0)","v":{"$error":"#N/A"}}]
[null,null,null,null,null,null,null,null,null,null,null,null,null,{"$f":"N16","v":{"$error":"#N/A"}},{"$f":"IFERROR(O16*K10*1000,\"не правильно заданы параметры\")","v":"не правильно заданы параметры"},{"$f":"P16","v":0},{"$f":"Q16*H5","v":0},{"$f":"R16","v":{"$error":"#N/A"}},{"$f":"IFERROR(S16,\"укажитекорретные параметры\")","v":"укажитекорретные параметры"}]
[null,null,null,null,null,null,null,null,null,null,null,null,null,null,null,null,null,null," "]
[null,null,null,null,null,null,null,null,null,null,null,null,null,null,{"$f":"IF(K10=0,0,IF(AND(C10=R29,G10=R30,J10=S30),VLOOKUP($H$4,O80:Z91,2),IF(AND(C10=R29,G10=R30,J10=R78),VLOOKUP($H$4,O80:Z91,4),IF(AND(C10=R29,G10=R30,J10=T78),VLOOKUP($H$4,O80:Z91,6),IF(AND(C10=R29,G10=R30,J10=V78),VLOOKUP($H$4,O80:Z91,8),0)))))","v":0},null,null,null,"с1"]
[null,null,null,null,null,null,null,null,null,null,null,null,null,null,null,null,null,null,"c2",{"$f":"IF(OR(#REF!=0,#REF!=0,#REF!=0),0,IF(#REF!=R29,VLOOKUP($H$4,#REF!,IF(AND(#REF!=R30,#REF!=#REF!),2,IF(AND(#REF!=R31,#REF!=#REF!),3,0))),0))","v":{"$error":"#REF!"}}]
{"$rows_left_out":149}